{"text_format":"1","workbook":"xlsx","n_sheets":5,"sheets":["10s or Better","Double Bonus","Jacks or Better","Deuces Wild","Set Up"],"not_rendered":{"charts":0,"images":1,"macros":1,"external_links":0,"defined_names":4,"comments":0,"pivot_tables":0},"unopened":[],"bounds":{"document_bytes":16777216,"sheet_cells":100000,"rows_first":2000,"rows_last":500,"rows_between":2000,"halvings":0,"cell_chars":16384,"cell_head_chars":4096},"cells_cut":0,"cells_raw":0,"read":"whole","date_system":"1900"}

{"sheet":"10s or Better","index":0,"n_rows":55,"n_cols":21,"rows_kept":55,"cut":false,"hidden":false,"merged":[[15,6,15,14],[27,10,27,11],[23,6,24,6],[23,8,24,8],[23,10,24,10],[1,5,2,5],[1,16,2,16],[18,4,18,5],[19,4,19,5],[23,12,24,12],[23,14,24,14]]}
[]
[]
[null,null,null,null,null,null,null,null,null,null,null,null,null,null,null,null,null,null,null,"A","§"]
[null,null,null,null,null,"Hand",null,null,"1 credit",null,"2 credits",null,"3 credits",null,"4 credits",null,"5 credits",null,null,2,"§"]
[null,null,null,null,null,"Royal Flush",null,null,250,null,500,null,750,null,1000,null,null,null,null,3,"§"]
[null,null,null,null,null,"Straight Flush",null,null,50,null,100,null,150,null,200,null,250,null,{"$f":"'Set Up'!D5","v":29999999},4,"§"]
[null,null,null,null,null,"Four of a kind",null,null,25,null,50,null,75,null,100,null,125,null,null,5,"§"]
[null,null,null,null,null,"Full House",null,null,9,null,18,null,27,null,36,null,45,null,null,6,"§"]
[null,null,null,null,null,"Flush",null,null,6,null,12,null,18,null,24,null,30,null,null,7,"§"]
[null,null,null,null,null,"Straight",null,null,4,null,8,null,12,null,16,null,20,null,null,8,"§"]
[null,null,null,null,null,"Three of a Kind",null,null,3,null,6,null,9,null,12,null,15,null,null,9,"§"]
[null,null,null,null,null,"Two Pair",null,null,2,null,4,null,6,null,8,null,10,null,null,10,"§"]
[null,null,null,null,null,"Ten's or Better",null,null,1,null,2,null,3,null,4,null,5,null,null,"J","§"]
[null,null,null,null,null,null,null,null,null,null,null,null,null,null,null,null,null,null,null,"Q","§"]
[null,null,null,null,null,null,null,null,null,null,null,null,null,null,null,null,null,null,null,"K","§"]
[null,null,null,null,null,null,"Hand Complete",null,null,null,null,null,null,null,null,null,null,null,null,"A","ª"]
[null,null,null,null,null,null,null,null,null,null,null,null,null,null,null,null,null,null,null,2,"ª"]
[null,null,null,null,null,null,9,null,9,null,9,null,4,null,"Q",null,null,null,null,3,"ª"]
[null,null,null,null,{"$f":"IF(G16=\"Hand Complete\",\"Place\",\"\")","v":"Place"},null,"§",null,"ª",null,"©",null,"¨",null,"¨",null,null,null,null,4,"ª"]
[null,null,null,null,{"$f":"IF(G16=\"Hand Complete\",\"Bet / Deal\",\"\")","v":"Bet / Deal"},null,null,null,null,null,null,null,null,null,null,null,null,null,null,5,"ª"]
[null,null,null,null,null,null,{"$f":"IF(G19=\"\",\"\",G19)","v":"§"},null,{"$f":"IF(I19=\"\",\"\",I19)","v":"ª"},null,{"$f":"IF(K19=\"\",\"\",K19)","v":"©"},null,{"$f":"IF(M19=\"\",\"\",M19)","v":"¨"},null,{"$f":"IF(O19=\"\",\"\",O19)","v":"¨"},null,null,null,null,6,"ª"]
[null,null,null,null,null,null,{"$f":"IF(G18=0,\"\",G18)","v":9},null,{"$f":"IF(I18=0,\"\",I18)","v":9},null,{"$f":"IF(K18=0,\"\",K18)","v":9},null,{"$f":"IF(M18=0,\"\",M18)","v":4},null,{"$f":"IF(O18=0,\"\",O18)","v":"Q"},null,null,null,null,7,"ª"]
[null,null,null,null,null,null,null,null,null,null,null,null,null,null,null,null,null,null,null,8,"ª"]
[null,null,null,null,5,null,"HOLD",null,"HOLD",null,"HOLD",null,"HOLD",null,"HOLD",null,null,null,null,9,"ª"]
[null,null,null,null,null,null,null,null,null,null,null,null,null,null,null,null,null,null,null,10,"ª"]
[null,null,null,null,0,null,null,null,null,null,null,null,null,null,null,null,null,null,null,"J","ª"]
[null,null,null,null,null,null,null,null,null,null,null,null,null,null,null,null,null,null,null,"Q","ª"]
[null,null,null,null,null,"BET",0,null,null,null,"ACCOUNT",null,225,null,null,null,null,null,null,"K","ª"]
[null,null,null,null,null,null,null,null,null,null,null,null,null,null,null,null,null,null,null,"A","¨"]
[null,null,null,null,null,null,null,null,null,null,null,null,null,null,null,null,null,null,null,2,"¨"]
[null,null,null,null,null,null,{"$f":"IF(G18=\"A\",14,0)","v":0},null,{"$f":"IF(I18=\"A\",14,0)","v":0},null,{"$f":"IF(K18=\"A\",14,0)","v":0},null,{"$f":"IF(M18=\"A\",14,0)","v":0},null,{"$f":"IF(O18=\"A\",14,0)","v":0},null,null,{"$f":"SUM(IF(G31:O31=14,1,0))","v":0},{"$f":"IF(AND(R31=1,R30=1),1,0)","v":0},3,"¨"]
[null,null,null,null,null,null,{"$f":"IF(G18=2,2,0)","v":0},null,{"$f":"IF(I18=2,2,0)","v":0},null,{"$f":"IF(K18=2,2,0)","v":0},null,{"$f":"IF(M18=2,2,0)","v":0},null,{"$f":"IF(O18=2,2,0)","v":0},null,null,{"$f":"SUM(IF(G32:O32=2,1,0))","v":0},0,4,"¨"]
[null,null,null,null,null,null,{"$f":"IF(G18=3,3,0)","v":0},null,{"$f":"IF(I18=3,3,0)","v":0},null,{"$f":"IF(K18=3,3,0)","v":0},null,{"$f":"IF(M18=3,3,0)","v":0},null,{"$f":"IF(O18=3,3,0)","v":0},null,null,{"$f":"SUM(IF(G33:O33=3,1,0))","v":0},0,5,"¨"]
[null,null,null,null,null,null,{"$f":"IF(G18=4,4,0)","v":0},null,{"$f":"IF(I18=4,4,0)","v":0},null,{"$f":"IF(K18=4,4,0)","v":0},null,{"$f":"IF(M18=4,4,0)","v":4},null,{"$f":"IF(O18=4,4,0)","v":0},null,null,{"$f":"SUM(IF(G34:O34=4,1,0))","v":1},0,6,"¨"]
[null,null,null,null,null,null,{"$f":"IF(G18=5,5,0)","v":0},null,{"$f":"IF(I18=5,5,0)","v":0},null,{"$f":"IF(K18=5,5,0)","v":0},null,{"$f":"IF(M18=5,5,0)","v":0},null,{"$f":"IF(O18=5,5,0)","v":0},null,null,{"$f":"SUM(IF(G35:O35=5,1,0))","v":0},0,7,"¨"]
[null,null,null,null,null,null,{"$f":"IF(G18=6,6,0)","v":0},null,{"$f":"IF(I18=6,6,0)","v":0},null,{"$f":"IF(K18=6,6,0)","v":0},null,{"$f":"IF(M18=6,6,0)","v":0},null,{"$f":"IF(O18=6,6,0)","v":0},null,null,{"$f":"SUM(IF(G36:O36=6,1,0))","v":0},0,8,"¨"]
[null,null,null,null,null,null,{"$f":"IF(G18=7,7,0)","v":0},null,{"$f":"IF(I18=7,7,0)","v":0},null,{"$f":"IF(K18=7,7,0)","v":0},null,{"$f":"IF(M18=7,7,0)","v":0},null,{"$f":"IF(O18=7,7,0)","v":0},null,null,{"$f":"SUM(IF(G37:O37=7,1,0))","v":0},0,9,"¨"]
[null,null,null,null,null,null,{"$f":"IF(G18=8,8,0)","v":0},null,{"$f":"IF(I18=8,8,0)","v":0},null,{"$f":"IF(K18=8,8,0)","v":0},null,{"$f":"IF(M18=8,8,0)","v":0},null,{"$f":"IF(O18=8,8,0)","v":0},null,null,{"$f":"SUM(IF(G38:O38=8,1,0))","v":0},0,10,"¨"]
[null,null,null,null,null,null,{"$f":"IF(G18=9,9,0)","v":9},null,{"$f":"IF(I18=9,9,0)","v":9},null,{"$f":"IF(K18=9,9,0)","v":9},null,{"$f":"IF(M18=9,9,0)","v":0},null,{"$f":"IF(O18=9,9,0)","v":0},null,null,{"$f":"SUM(IF(G39:O39=9,1,0))","v":3},0,"J","¨"]
[null,null,null,null,null,null,{"$f":"IF(G18=10,10,0)","v":0},null,{"$f":"IF(I18=10,10,0)","v":0},null,{"$f":"IF(K18=10,10,0)","v":0},null,{"$f":"IF(M18=10,10,0)","v":0},null,{"$f":"IF(O18=10,10,0)","v":0},null,null,{"$f":"SUM(IF(G40:O40=10,1,0))","v":0},0,"Q","¨"]
[null,null,null,null,null,null,{"$f":"IF(G18=\"J\",11,0)","v":0},null,{"$f":"IF(I18=\"J\",11,0)","v":0},null,{"$f":"IF(K18=\"J\",11,0)","v":0},null,{"$f":"IF(M18=\"J\",11,0)","v":0},null,{"$f":"IF(O18=\"J\",11,0)","v":0},null,null,{"$f":"SUM(IF(G41:O41=11,1,0))","v":0},0,"K","¨"]
[null,null,null,null,null,null,{"$f":"IF(G18=\"Q\",12,0)","v":0},null,{"$f":"IF(I18=\"Q\",12,0)","v":0},null,{"$f":"IF(K18=\"Q\",12,0)","v":0},null,{"$f":"IF(M18=\"Q\",12,0)","v":0},null,{"$f":"IF(O18=\"Q\",12,0)","v":12},null,null,{"$f":"SUM(IF(G42:O42=12,1,0))","v":1},0,"A","©"]
[null,null,null,null,null,null,{"$f":"IF(G18=\"K\",13,0)","v":0},null,{"$f":"IF(I18=\"K\",13,0)","v":0},null,{"$f":"IF(K18=\"K\",13,0)","v":0},null,{"$f":"IF(M18=\"K\",13,0)","v":0},null,{"$f":"IF(O18=\"K\",13,0)","v":0},null,null,{"$f":"SUM(IF(G43:O43=13,1,0))","v":0},0,2,"©"]
[null,null,null,null,null,null,{"$f":"SUM(G31:G43)","v":9},null,{"$f":"SUM(I31:I43)","v":9},null,{"$f":"SUM(K31:K43)","v":9},null,{"$f":"SUM(M31:M43)","v":4},null,{"$f":"SUM(O31:O43)","v":12},null,{"$f":"SUM(IF(G44:O44>9,1,0))","v":1},{"$f":"IF(AND(R31=1,R32=0),1,0)","v":0},{"$f":"IF(AND(R44=1,R43=1,S31=0),1,0)","v":0},3,"©"]
[null,null,null,null,null,null,null,null,null,null,null,null,null,null,null,null,null,null,{"$f":"SUM(S31:S44)","v":0},4,"©"]
[null,null,null,null,null,null,null,null,null,null,null,null,null,null,null,null,null,null,null,5,"©"]
[null,null,null,null,null,null,null,null,null,null,null,null,null,null,null,null,"jack",{"$f":"R40","v":0},null,6,"©"]
[null,null,null,null,null,null,null,null,null,null,null,null,null,null,null,null,"2 pair",{"$f":"SUM(IF(R31:R43=2,1,0))","v":0},null,7,"©"]
[null,null,null,null,null,null,null,null,null,null,null,null,null,null,null,null,"3 kind",{"$f":"SUM(IF(R31:R43=3,1,0))","v":1},null,8,"©"]
[null,null,null,null,null,null,null,null,null,null,null,null,null,null,null,null,"straight",{"$f":"IF(S45=4,1,0)","v":0},null,9,"©"]
[null,null,null,null,null,null,null,null,null,null,null,null,null,null,null,null,"flush",{"$f":"IF(AND(G19=I19,I19=K19,K19=M19,M19=O19),1,0)","v":0},null,10,"©"]
[null,null,null,null,null,null,null,null,null,null,null,null,null,null,null,null,"f house",{"$f":"IF(AND(R48=1,R49=1),1,0)","v":0},null,"J","©"]
[null,null,null,null,null,null,null,null,null,null,null,null,null,null,null,null,"4 kind",{"$f":"SUM(IF(R31:R43=4,1,0))","v":0},null,"Q","©"]
[null,null,null,null,null,null,null,null,null,null,null,null,null,null,null,null,"st flsh",{"$f":"IF(AND(R51=1,R50=1),1,0)","v":0},null,"K","©"]
[null,null,null,null,null,null,null,null,null,null,null,null,null,null,null,null,"r flsh",{"$f":"IF(AND(Q44=5,R51=1),1,0)","v":0}]

{"sheet":"Double Bonus","index":1,"n_rows":55,"n_cols":21,"rows_kept":55,"cut":false,"hidden":false,"merged":[[27,10,27,11],[23,6,24,6],[23,8,24,8],[23,10,24,10],[5,17,15,17],[23,12,24,12],[23,14,24,14],[15,6,15,14],[1,5,2,5],[1,16,2,16],[18,4,18,5],[19,4,19,5]]}
[]
[null,null,null,null,null,"VIDEO",null,null,null,null,null,null,null,null,null,null,"POKER"]
[null,null,null,null,null,null,null,null,null,null,null,null,null,null,null,null,null,null,null,"A","§"]
[null,null,null,null,null,"Hand",null,null,"1 credit",null,"2 credits",null,"3 credits",null,"4 credits",null,"5 credits",null,null,2,"§"]
[null,null,null,null,null,"Royal Flush",null,null,250,null,500,null,750,null,1000,null,4000,null,null,3,"§"]
[null,null,null,null,null,"Straight Flush",null,null,50,null,100,null,150,null,200,null,250,"Play 1 to 5 Coins",{"$f":"'Set Up'!D5","v":29999999},4,"§"]
[null,null,null,null,null,"Four Aces",null,null,160,null,320,null,480,null,640,null,800,null,null,5,"§"]
[null,null,null,null,null,"Full House",null,null,10,null,20,null,30,null,40,null,50,null,null,6,"§"]
[null,null,null,null,null,"Flush",null,null,7,null,14,null,21,null,28,null,35,null,null,7,"§"]
[null,null,null,null,null,"Straight",null,null,5,null,10,null,15,null,20,null,25,null,null,8,"§"]
[null,null,null,null,null,"Three of a Kind",null,null,3,null,6,null,9,null,12,null,15,null,null,9,"§"]
[null,null,null,null,null,"Two Pair",null,null,2,null,4,null,6,null,8,null,10,null,null,10,"§"]
[null,null,null,null,null,"Jacks or Better",null,null,1,null,2,null,3,null,4,null,5,null,null,"J","§"]
[null,null,null,null,null,null,null,null,null,null,null,null,null,null,null,null,null,null,null,"Q","§"]
[null,null,null,null,null,null,null,null,null,null,null,null,null,null,null,null,null,null,null,"K","§"]
[null,null,null,null,null,null,"Hand Complete",null,null,null,null,null,null,null,null,null,null,null,null,"A","ª"]
[null,null,null,null,null,null,null,null,null,null,null,null,null,null,null,null,null,null,null,2,"ª"]
[null,null,null,null,null,null,"K",null,"K",null,"K",null,3,null,"K",null,null,null,null,3,"ª"]
[null,null,null,null,{"$f":"IF(G16=\"Hand Complete\",\"Place\",\"\")","v":"Place"},null,"¨",null,"©",null,"§",null,"¨",null,"ª",null,null,null,null,4,"ª"]
[null,null,null,null,{"$f":"IF(G16=\"Hand Complete\",\"Bet / Deal\",\"\")","v":"Bet / Deal"},null,null,null,null,null,null,null,null,null,null,null,null,null,null,5,"ª"]
[null,null,null,null,null,null,{"$f":"IF(G19=\"\",\"\",G19)","v":"¨"},null,{"$f":"IF(I19=\"\",\"\",I19)","v":"©"},null,{"$f":"IF(K19=\"\",\"\",K19)","v":"§"},null,{"$f":"IF(M19=\"\",\"\",M19)","v":"¨"},null,{"$f":"IF(O19=\"\",\"\",O19)","v":"ª"},null,null,null,null,6,"ª"]
[null,null,null,null,null,null,{"$f":"IF(G18=0,\"\",G18)","v":"K"},null,{"$f":"IF(I18=0,\"\",I18)","v":"K"},null,{"$f":"IF(K18=0,\"\",K18)","v":"K"},null,{"$f":"IF(M18=0,\"\",M18)","v":3},null,{"$f":"IF(O18=0,\"\",O18)","v":"K"},null,null,null,null,7,"ª"]
[null,null,null,null,null,null,null,null,null,null,null,null,null,null,null,null,null,null,null,8,"ª"]
[null,null,null,null,5,null,"HOLD",null,"HOLD",null,"HOLD",null,"HOLD",null,"HOLD",null,null,null,null,9,"ª"]
[null,null,null,null,null,null,null,null,null,null,null,null,null,null,null,null,null,null,null,10,"ª"]
[null,null,null,null,0,null,null,null,null,null,null,null,null,null,null,null,null,null,null,"J","ª"]
[null,null,null,null,null,null,null,null,null,null,null,null,null,null,null,null,null,null,null,"Q","ª"]
[null,null,null,null,null,"BET",0,null,null,null,"ACCOUNT",null,100,null,null,null,null,null,null,"K","ª"]
[null,null,null,null,null,null,null,null,null,null,null,null,null,null,null,null,null,null,null,"A","¨"]
[null,null,null,null,null,null,null,null,null,null,null,null,null,null,null,null,null,null,null,2,"¨"]
[null,null,null,null,null,null,{"$f":"IF(G18=\"A\",14,0)","v":0},null,{"$f":"IF(I18=\"A\",14,0)","v":0},null,{"$f":"IF(K18=\"A\",14,0)","v":0},null,{"$f":"IF(M18=\"A\",14,0)","v":0},null,{"$f":"IF(O18=\"A\",14,0)","v":0},null,null,{"$f":"SUM(IF(G31:O31=14,1,0))","v":0},{"$f":"IF(AND(R31=1,R30=1),1,0)","v":0},3,"¨"]
[null,null,null,null,null,null,{"$f":"IF(G18=2,2,0)","v":0},null,{"$f":"IF(I18=2,2,0)","v":0},null,{"$f":"IF(K18=2,2,0)","v":0},null,{"$f":"IF(M18=2,2,0)","v":0},null,{"$f":"IF(O18=2,2,0)","v":0},null,null,{"$f":"SUM(IF(G32:O32=2,1,0))","v":0},0,4,"¨"]
[null,null,null,null,null,null,{"$f":"IF(G18=3,3,0)","v":0},null,{"$f":"IF(I18=3,3,0)","v":0},null,{"$f":"IF(K18=3,3,0)","v":0},null,{"$f":"IF(M18=3,3,0)","v":3},null,{"$f":"IF(O18=3,3,0)","v":0},null,null,{"$f":"SUM(IF(G33:O33=3,1,0))","v":1},0,5,"¨"]
[null,null,null,null,null,null,{"$f":"IF(G18=4,4,0)","v":0},null,{"$f":"IF(I18=4,4,0)","v":0},null,{"$f":"IF(K18=4,4,0)","v":0},null,{"$f":"IF(M18=4,4,0)","v":0},null,{"$f":"IF(O18=4,4,0)","v":0},null,null,{"$f":"SUM(IF(G34:O34=4,1,0))","v":0},0,6,"¨"]
[null,null,null,null,null,null,{"$f":"IF(G18=5,5,0)","v":0},null,{"$f":"IF(I18=5,5,0)","v":0},null,{"$f":"IF(K18=5,5,0)","v":0},null,{"$f":"IF(M18=5,5,0)","v":0},null,{"$f":"IF(O18=5,5,0)","v":0},null,null,{"$f":"SUM(IF(G35:O35=5,1,0))","v":0},0,7,"¨"]
[null,null,null,null,null,null,{"$f":"IF(G18=6,6,0)","v":0},null,{"$f":"IF(I18=6,6,0)","v":0},null,{"$f":"IF(K18=6,6,0)","v":0},null,{"$f":"IF(M18=6,6,0)","v":0},null,{"$f":"IF(O18=6,6,0)","v":0},null,null,{"$f":"SUM(IF(G36:O36=6,1,0))","v":0},0,8,"¨"]
[null,null,null,null,null,null,{"$f":"IF(G18=7,7,0)","v":0},null,{"$f":"IF(I18=7,7,0)","v":0},null,{"$f":"IF(K18=7,7,0)","v":0},null,{"$f":"IF(M18=7,7,0)","v":0},null,{"$f":"IF(O18=7,7,0)","v":0},null,null,{"$f":"SUM(IF(G37:O37=7,1,0))","v":0},0,9,"¨"]
[null,null,null,null,null,null,{"$f":"IF(G18=8,8,0)","v":0},null,{"$f":"IF(I18=8,8,0)","v":0},null,{"$f":"IF(K18=8,8,0)","v":0},null,{"$f":"IF(M18=8,8,0)","v":0},null,{"$f":"IF(O18=8,8,0)","v":0},null,null,{"$f":"SUM(IF(G38:O38=8,1,0))","v":0},0,10,"¨"]
[null,null,null,null,null,null,{"$f":"IF(G18=9,9,0)","v":0},null,{"$f":"IF(I18=9,9,0)","v":0},null,{"$f":"IF(K18=9,9,0)","v":0},null,{"$f":"IF(M18=9,9,0)","v":0},null,{"$f":"IF(O18=9,9,0)","v":0},null,null,{"$f":"SUM(IF(G39:O39=9,1,0))","v":0},0,"J","¨"]
[null,null,null,null,null,null,{"$f":"IF(G18=10,10,0)","v":0},null,{"$f":"IF(I18=10,10,0)","v":0},null,{"$f":"IF(K18=10,10,0)","v":0},null,{"$f":"IF(M18=10,10,0)","v":0},null,{"$f":"IF(O18=10,10,0)","v":0},null,null,{"$f":"SUM(IF(G40:O40=10,1,0))","v":0},0,"Q","¨"]
[null,null,null,null,null,null,{"$f":"IF(G18=\"J\",11,0)","v":0},null,{"$f":"IF(I18=\"J\",11,0)","v":0},null,{"$f":"IF(K18=\"J\",11,0)","v":0},null,{"$f":"IF(M18=\"J\",11,0)","v":0},null,{"$f":"IF(O18=\"J\",11,0)","v":0},null,null,{"$f":"SUM(IF(G41:O41=11,1,0))","v":0},0,"K","¨"]
[null,null,null,null,null,null,{"$f":"IF(G18=\"Q\",12,0)","v":0},null,{"$f":"IF(I18=\"Q\",12,0)","v":0},null,{"$f":"IF(K18=\"Q\",12,0)","v":0},null,{"$f":"IF(M18=\"Q\",12,0)","v":0},null,{"$f":"IF(O18=\"Q\",12,0)","v":0},null,null,{"$f":"SUM(IF(G42:O42=12,1,0))","v":0},0,"A","©"]
[null,null,null,null,null,null,{"$f":"IF(G18=\"K\",13,0)","v":13},null,{"$f":"IF(I18=\"K\",13,0)","v":13},null,{"$f":"IF(K18=\"K\",13,0)","v":13},null,{"$f":"IF(M18=\"K\",13,0)","v":0},null,{"$f":"IF(O18=\"K\",13,0)","v":13},null,null,{"$f":"SUM(IF(G43:O43=13,1,0))","v":4},0,2,"©"]
[null,null,null,null,null,null,{"$f":"SUM(G31:G43)","v":13},null,{"$f":"SUM(I31:I43)","v":13},null,{"$f":"SUM(K31:K43)","v":13},null,{"$f":"SUM(M31:M43)","v":3},null,{"$f":"SUM(O31:O43)","v":13},null,{"$f":"SUM(IF(G44:O44>9,1,0))","v":4},{"$f":"IF(AND(R31=1,R32=0),1,0)","v":0},{"$f":"IF(AND(R44=1,R43=1,S31=0),1,0)","v":0},3,"©"]
[null,null,null,null,null,null,null,null,null,null,null,null,null,null,null,null,null,null,{"$f":"SUM(S31:S44)","v":0},4,"©"]
[null,null,null,null,null,null,null,null,null,null,null,null,null,null,null,null,null,null,null,5,"©"]
[null,null,null,null,null,null,null,null,null,null,null,null,null,null,null,null,"jack",{"$f":"R41","v":0},null,6,"©"]
[null,null,null,null,null,null,null,null,null,null,null,null,null,null,null,null,"2 pair",{"$f":"SUM(IF(R31:R43=2,1,0))","v":0},null,7,"©"]
[null,null,null,null,null,null,null,null,null,null,null,null,null,null,null,null,"3 kind",{"$f":"SUM(IF(R31:R43>2,1,0))","v":1},null,8,"©"]
[null,null,null,null,null,null,null,null,null,null,null,null,null,null,null,null,"straight",{"$f":"IF(S45=4,1,0)","v":0},null,9,"©"]
[null,null,null,null,null,null,null,null,null,null,null,null,null,null,null,null,"flush",{"$f":"IF(AND(G19=I19,I19=K19,K19=M19,M19=O19),1,0)","v":0},null,10,"©"]
[null,null,null,null,null,null,null,null,null,null,null,null,null,null,null,null,"f house",{"$f":"IF(AND(R48=1,R49=1),1,0)","v":0},null,"J","©"]
[null,null,null,null,null,null,null,null,null,null,null,null,null,null,null,null,"4 kind",{"$f":"IF(R31=4,1,0)","v":0},null,"Q","©"]
[null,null,null,null,null,null,null,null,null,null,null,null,null,null,null,null,"st flsh",{"$f":"IF(AND(R51=1,R50=1),1,0)","v":0},null,"K","©"]
[null,null,null,null,null,null,null,null,null,null,null,null,null,null,null,null,"r flsh",{"$f":"IF(AND(Q44=5,R51=1),1,0)","v":0}]

{"sheet":"Jacks or Better","index":2,"n_rows":55,"n_cols":21,"rows_kept":55,"cut":false,"hidden":false,"merged":[[1,5,2,5],[1,16,2,16],[18,4,18,5],[19,4,19,5],[19,16,19,17],[15,6,15,14],[27,10,27,11],[23,6,24,6],[23,8,24,8],[23,10,24,10],[20,16,20,17],[21,16,21,17],[23,12,24,12],[23,14,24,14]]}
[]
[null,null,null,null,null,"VIDEO",null,null,null,null,null,null,null,null,null,null,"POKER"]
[null,null,null,null,null,null,null,null,null,null,null,null,null,null,null,null,null,null,null,"A","§"]
[null,null,null,null,null,"Hand",null,null,"1 credit",null,"2 credits",null,"3 credits",null,"4 credits",null,"5 credits",null,null,2,"§"]
[null,null,null,null,null,"Royal Flush",null,null,250,null,500,null,750,null,1000,null,4000,null,null,3,"§"]
[null,null,null,null,null,"Straight Flush",null,null,50,null,100,null,150,null,200,null,250,null,{"$f":"'Set Up'!D5","v":29999999},4,"§"]
[null,null,null,null,null,"Four of a kind",null,null,25,null,50,null,75,null,100,null,125,null,null,5,"§"]
[null,null,null,null,null,"Full House",null,null,9,null,18,null,27,null,36,null,45,null,null,6,"§"]
[null,null,null,null,null,"Flush",null,null,6,null,12,null,18,null,24,null,30,null,null,7,"§"]
[null,null,null,null,null,"Straight",null,null,4,null,8,null,12,null,16,null,20,null,null,8,"§"]
[null,null,null,null,null,"Three of a Kind",null,null,3,null,6,null,9,null,12,null,15,null,null,9,"§"]
[null,null,null,null,null,"Two Pair",null,null,2,null,4,null,6,null,8,null,10,null,null,10,"§"]
[null,null,null,null,null,"Jacks or Better",null,null,1,null,2,null,3,null,4,null,5,null,null,"J","§"]
[null,null,null,null,null,null,null,null,null,null,null,null,null,null,null,null,null,null,null,"Q","§"]
[null,null,null,null,null,null,null,null,null,null,null,null,null,null,null,null,null,null,null,"K","§"]
[null,null,null,null,null,null,"Hand Complete",null,null,null,null,null,null,null,null,null,null,null,null,"A","ª"]
[null,null,null,null,null,null,null,null,null,null,null,null,null,null,null,null,null,null,null,2,"ª"]
[null,null,null,null,null,null,"K",null,10,null,"K",null,"J",null,"A",null,null,null,null,3,"ª"]
[null,null,null,null,{"$f":"IF(G16=\"Hand Complete\",\"Place\",\"\")","v":"Place"},null,"ª",null,"ª",null,"¨",null,"§",null,"¨",null,null,null,null,4,"ª"]
[null,null,null,null,{"$f":"IF(G16=\"Hand Complete\",\"Bet / Deal\",\"\")","v":"Bet / Deal"},null,null,null,null,null,null,null,null,null,null,null,{"$f":"IF(E26=0,\"Play 1 to 5\",\"\")","v":"Play 1 to 5"},null,null,5,"ª"]
[null,null,null,null,null,null,{"$f":"IF(G19=\"\",\"\",G19)","v":"ª"},null,{"$f":"IF(I19=\"\",\"\",I19)","v":"ª"},null,{"$f":"IF(K19=\"\",\"\",K19)","v":"¨"},null,{"$f":"IF(M19=\"\",\"\",M19)","v":"§"},null,{"$f":"IF(O19=\"\",\"\",O19)","v":"¨"},null,"Coins",null,null,6,"ª"]
[null,null,null,null,null,null,{"$f":"IF(G18=0,\"\",G18)","v":"K"},null,{"$f":"IF(I18=0,\"\",I18)","v":10},null,{"$f":"IF(K18=0,\"\",K18)","v":"K"},null,{"$f":"IF(M18=0,\"\",M18)","v":"J"},null,{"$f":"IF(O18=0,\"\",O18)","v":"A"},null,null,null,null,7,"ª"]
[null,null,null,null,null,null,{"$f":"IF(G18=\"A\",14,IF(G18=\"Q\",12,IF(G18=\"K\",13,IF(G18=\"J\",11,G18))))","v":13},null,{"$f":"IF(I18=\"A\",14,IF(I18=\"Q\",12,IF(I18=\"K\",13,IF(I18=\"J\",11,I18))))","v":10},null,{"$f":"IF(K18=\"A\",14,IF(K18=\"Q\",12,IF(K18=\"K\",13,IF(K18=\"J\",11,K18))))","v":13},null,{"$f":"IF(M18=\"A\",14,IF(M18=\"Q\",12,IF(M18=\"K\",13,IF(M18=\"J\",11,M18))))","v":11},null,{"$f":"IF(O18=\"A\",14,IF(O18=\"Q\",12,IF(O18=\"K\",13,IF(O18=\"J\",11,O18))))","v":14},null,null,null,null,8,"ª"]
[null,null,null,null,5,null,"HOLD",null,"HOLD",null,"HOLD",null,"HOLD",null,"HOLD",null,null,null,null,9,"ª"]
[null,null,null,null,null,null,null,null,null,null,null,null,null,null,null,null,null,null,null,10,"ª"]
[null,null,null,null,0,null,null,null,null,null,null,null,null,null,null,null,null,null,null,"J","ª"]
[null,null,null,null,null,null,null,null,null,null,null,null,null,null,null,null,null,null,null,"Q","ª"]
[null,null,null,null,null,"BET",0,null,null,null,"ACCOUNT",null,60,null,null,null,null,null,null,"K","ª"]
[null,null,null,null,null,null,null,null,null,null,null,null,null,null,null,null,null,null,null,"A","¨"]
[null,null,null,null,null,null,null,null,null,null,null,null,null,null,null,null,null,null,null,2,"¨"]
[null,null,null,null,null,14,{"$f":"SUM(IF($G$23:$O$23=F31,1,0))","v":1},null,null,null,null,null,null,null,null,null,null,{"$f":"SUM(IF(G31>0,1,0))","v":1},{"$f":"IF(AND(R31=1,R30=1),1,0)","v":0},3,"¨"]
[null,null,null,null,null,13,{"$f":"SUM(IF($G$23:$O$23=F32,1,0))","v":2},null,null,null,null,null,null,null,null,null,null,1,1,4,"¨"]
[null,null,null,null,null,12,{"$f":"SUM(IF($G$23:$O$23=F33,1,0))","v":0},null,null,null,null,null,null,null,null,null,null,0,0,5,"¨"]
[null,null,null,null,null,11,{"$f":"SUM(IF($G$23:$O$23=F34,1,0))","v":1},null,null,null,null,null,null,null,null,null,null,1,0,6,"¨"]
[null,null,null,null,null,10,{"$f":"SUM(IF($G$23:$O$23=F35,1,0))","v":1},null,null,null,null,null,null,null,null,null,null,1,1,7,"¨"]
[null,null,null,null,null,9,{"$f":"SUM(IF($G$23:$O$23=F36,1,0))","v":0},null,null,null,null,null,null,null,null,null,null,0,0,8,"¨"]
[null,null,null,null,null,8,{"$f":"SUM(IF($G$23:$O$23=F37,1,0))","v":0},null,null,null,null,null,null,null,null,null,null,0,0,9,"¨"]
[null,null,null,null,null,7,{"$f":"SUM(IF($G$23:$O$23=F38,1,0))","v":0},null,null,null,null,null,null,null,null,null,null,0,0,10,"¨"]
[null,null,null,null,null,6,{"$f":"SUM(IF($G$23:$O$23=F39,1,0))","v":0},null,null,null,null,null,null,null,null,null,null,0,0,"J","¨"]
[null,null,null,null,null,5,{"$f":"SUM(IF($G$23:$O$23=F40,1,0))","v":0},null,null,null,null,null,null,null,null,null,null,0,0,"Q","¨"]
[null,null,null,null,null,4,{"$f":"SUM(IF($G$23:$O$23=F41,1,0))","v":0},null,null,null,null,null,null,null,null,null,null,0,0,"K","¨"]
[null,null,null,null,null,3,{"$f":"SUM(IF($G$23:$O$23=F42,1,0))","v":0},null,null,null,null,null,null,null,null,null,null,0,0,"A","©"]
[null,null,null,null,null,2,{"$f":"SUM(IF($G$23:$O$23=F43,1,0))","v":0},null,null,null,null,null,null,null,null,null,"ROYAL",0,0,2,"©"]
[null,null,null,null,null,null,null,null,null,null,null,null,null,null,null,null,{"$f":"SUM(IF(G31:G35>0,1,0))","v":4},{"$f":"IF(AND(R31=1,R32=0),1,0)","v":0},{"$f":"IF(AND(R44=1,R43=1,S31=0),1,0)","v":0},3,"©"]
[null,null,null,null,null,null,null,null,null,null,null,null,null,null,null,null,null,null,{"$f":"SUM(S31:S44)","v":2},4,"©"]
[null,null,null,null,null,null,null,null,null,null,null,null,null,null,null,null,null,0,null,5,"©"]
[null,null,null,null,null,null,null,null,null,null,null,null,null,null,null,null,"jack",{"$f":"R41","v":0},null,6,"©"]
[null,null,null,null,null,null,null,null,null,null,null,null,null,null,null,null,"2 pair",{"$f":"SUM(IF(G31:G44=2,1,0))","v":1},null,7,"©"]
[null,null,null,null,null,null,null,null,null,null,null,null,null,null,null,null,"3 kind",{"$f":"SUM(IF(G31:G44>2,1,0))","v":0},null,8,"©"]
[null,null,null,null,null,null,null,null,null,null,null,null,null,null,null,null,"straight",{"$f":"IF(S45=4,1,0)","v":0},null,9,"©"]
[null,null,null,null,null,null,null,null,null,null,null,null,null,null,null,null,"flush",{"$f":"IF(AND(G19=I19,I19=K19,K19=M19,M19=O19),1,0)","v":0},null,10,"©"]
[null,null,null,null,null,null,null,null,null,null,null,null,null,null,null,null,"f house",{"$f":"IF(AND(R48=1,R49=1),1,0)","v":0},null,"J","©"]
[null,null,null,null,null,null,null,null,null,null,null,null,null,null,null,null,"4 kind",{"$f":"SUM(IF(G31:G44>3,1,0))","v":0},null,"Q","©"]
[null,null,null,null,null,null,null,null,null,null,null,null,null,null,null,null,"st flsh",{"$f":"IF(AND(R51=1,R50=1),1,0)","v":0},null,"K","©"]
[null,null,null,null,null,null,null,null,null,null,null,null,null,null,null,null,"r flsh",{"$f":"IF(AND(Q44=5,R51=1),1,0)","v":0}]

{"sheet":"Deuces Wild","index":3,"n_rows":61,"n_cols":21,"rows_kept":61,"cut":false,"hidden":false,"merged":[[15,6,15,14],[27,10,27,11],[23,6,24,6],[23,8,24,8],[23,10,24,10],[1,5,2,5],[1,16,2,16],[18,4,18,5],[19,4,19,5],[23,12,24,12],[23,14,24,14]]}
[]
[null,null,null,null,null,"VIDEO",null,null,null,null,null,null,null,null,null,null,"POKER"]
[null,null,null,null,null,null,null,null,null,null,null,null,null,null,null,null,null,null,null,"A","§"]
[null,null,null,null,null,"Hand",null,null,"1 credit",null,"2 credits",null,"3 credits",null,"4 credits",null,"5 credits",null,null,2,"§"]
[null,null,null,null,null,"Royal Flush",null,null,300,null,500,null,750,null,1000,null,4000,null,null,3,"§"]
[null,null,null,null,null,"Four Deuces",null,null,200,null,400,null,600,null,800,null,1000,"PLAY",{"$f":"'Set Up'!D5","v":29999999},4,"§"]
[null,null,null,null,null,"Wild Royal Flush",null,null,25,null,100,null,150,null,200,null,250,"1 TO 5",null,5,"§"]
[null,null,null,null,null,"Five of a Kind",null,null,15,null,50,null,75,null,100,null,125,"COINS",null,6,"§"]
[null,null,null,null,null,"Straight Flush",null,null,9,null,18,null,27,null,36,null,45,null,null,7,"§"]
[null,null,null,null,null,"Four of a kind",null,null,5,null,12,null,18,null,24,null,30,null,null,8,"§"]
[null,null,null,null,null,"Full House",null,null,3,null,8,null,12,null,16,null,20,null,null,9,"§"]
[null,null,null,null,null,"Flush",null,null,2,null,6,null,9,null,12,null,15,null,null,10,"§"]
[null,null,null,null,null,"Straight",null,null,2,null,4,null,6,null,8,null,10,null,null,"J","§"]
[null,null,null,null,null,"Three of a Kind",null,null,1,null,2,null,3,null,4,null,5,null,null,"Q","§"]
[null,null,null,null,null,null,null,null,null,null,null,null,null,null,null,null,null,null,null,"K","§"]
[null,null,null,null,null,null,"Hold or draw 1 to 5 cards",null,null,null,null,null,null,null,null,null,null,null,null,"A","ª"]
[null,null,null,null,null,null,null,null,null,null,null,null,null,null,null,null,null,null,null,2,"ª"]
[null,null,null,null,null,null,"A",null,4,2,"Q",null,9,null,6,null,null,null,null,3,"ª"]
[null,null,null,null,{"$f":"IF(G16=\"Hand Complete\",\"Place\",\"\")","v":""},null,"§",null,"ª",null,"¨",null,"ª",null,"©",null,null,null,null,4,"ª"]
[null,null,null,null,{"$f":"IF(G16=\"Hand Complete\",\"Bet / Deal\",\"\")","v":""},null,null,null,null,null,null,null,null,null,null,null,null,null,null,5,"ª"]
[null,null,null,null,null,null,{"$f":"IF(G19=\"\",\"\",G19)","v":"§"},null,{"$f":"IF(I19=\"\",\"\",I19)","v":"ª"},null,{"$f":"IF(K19=\"\",\"\",K19)","v":"¨"},null,{"$f":"IF(M19=\"\",\"\",M19)","v":"ª"},null,{"$f":"IF(O19=\"\",\"\",O19)","v":"©"},null,null,null,null,6,"ª"]
[null,null,null,null,null,null,{"$f":"IF(G18=0,\"\",G18)","v":"A"},null,{"$f":"IF(I18=0,\"\",I18)","v":4},null,{"$f":"IF(K18=0,\"\",K18)","v":"Q"},null,{"$f":"IF(M18=0,\"\",M18)","v":9},null,{"$f":"IF(O18=0,\"\",O18)","v":6},null,null,null,null,7,"ª"]
[null,null,null,null,null,null,null,null,null,null,null,null,null,null,null,null,null,null,null,8,"ª"]
[null,null,null,null,5,null,"HOLD",null,"HOLD",null,"HOLD",null,"HOLD",null,"HOLD",null,null,null,null,9,"ª"]
[null,null,null,null,null,null,null,null,null,null,null,null,null,null,null,null,null,null,null,10,"ª"]
[null,null,null,null,1,null,null,null,null,null,null,null,null,null,null,null,null,null,null,"J","ª"]
[null,null,null,null,null,null,null,null,null,null,null,null,null,null,null,null,null,null,null,"Q","ª"]
[null,null,null,null,null,"BET",5,null,null,null,"ACCOUNT",null,90,null,null,null,null,null,null,"K","ª"]
[null,null,null,null,null,null,null,null,null,null,null,null,null,null,null,null,null,null,null,"A","¨"]
[null,null,null,null,null,null,null,null,null,null,null,null,null,null,null,null,null,null,null,2,"¨"]
[null,null,null,null,null,{"$f":"SUM(IF(G18:O18=2,1,0))","v":1},{"$f":"IF(OR(G18=\"A\",G18=2),14,0)","v":14},null,{"$f":"IF(OR(I18=\"A\",I18=2),14,0)","v":0},null,{"$f":"IF(OR(K18=\"A\",K18=2),14,0)","v":0},null,{"$f":"IF(OR(M18=\"A\",M18=2),14,0)","v":0},null,{"$f":"IF(OR(O18=\"A\",O18=2),14,0)","v":0},null,null,{"$f":"SUM(IF(G31:Q31=14,1,0))","v":1},null,3,"¨"]
[null,null,null,null,null,null,{"$f":"IF(G18=2,2,0)","v":0},null,{"$f":"IF(I18=2,2,0)","v":0},null,{"$f":"IF(K18=2,2,0)","v":0},null,{"$f":"IF(M18=2,2,0)","v":0},null,{"$f":"IF(O18=2,2,0)","v":0},null,null,{"$f":"SUM(IF(G32:Q32=2,1,0))","v":0},null,4,"¨"]
[null,null,null,null,3,null,{"$f":"IF(OR(G18=3,G18=2),3,0)","v":0},null,{"$f":"IF(OR(I18=3,I18=2),3,0)","v":0},null,{"$f":"IF(OR(K18=3,K18=2),3,0)","v":0},null,{"$f":"IF(OR(M18=3,M18=2),3,0)","v":0},null,{"$f":"IF(OR(O18=3,O18=2),3,0)","v":0},null,null,{"$f":"SUM(IF(G33:Q33=3,1,0))","v":0},null,5,"¨"]
[null,null,null,null,4,null,{"$f":"IF(OR(G18=4,G18=2),4,0)","v":0},null,{"$f":"IF(OR(I18=4,I18=2),4,0)","v":4},null,{"$f":"IF(OR(K18=4,K18=2),4,0)","v":0},null,{"$f":"IF(OR(M18=4,M18=2),4,0)","v":0},null,{"$f":"IF(OR(O18=4,O18=2),4,0)","v":0},null,null,{"$f":"SUM(IF(G34:Q34=4,1,0))","v":1},null,6,"¨"]
[null,null,null,null,5,null,{"$f":"IF(OR(G18=5,G18=2),5,0)","v":0},null,{"$f":"IF(OR(I18=5,I18=2),5,0)","v":0},null,{"$f":"IF(OR(K18=5,K18=2),5,0)","v":0},null,{"$f":"IF(OR(M18=5,M18=2),5,0)","v":0},null,{"$f":"IF(OR(O18=5,O18=2),5,0)","v":0},null,null,{"$f":"SUM(IF(G35:Q35=5,1,0))","v":0},null,7,"¨"]
[null,null,null,null,6,null,{"$f":"IF(OR(G18=6,G18=2),6,0)","v":0},null,{"$f":"IF(OR(I18=6,I18=2),6,0)","v":0},null,{"$f":"IF(OR(K18=6,K18=2),6,0)","v":0},null,{"$f":"IF(OR(M18=6,M18=2),6,0)","v":0},null,{"$f":"IF(OR(O18=6,O18=2),6,0)","v":6},null,null,{"$f":"SUM(IF(G36:Q36=6,1,0))","v":1},null,8,"¨"]
[null,null,null,null,7,null,{"$f":"IF(OR(G18=7,G18=2),7,0)","v":0},null,{"$f":"IF(OR(I18=7,I18=2),7,0)","v":0},null,{"$f":"IF(OR(K18=7,K18=2),7,0)","v":0},null,{"$f":"IF(OR(M18=7,M18=2),7,0)","v":0},null,{"$f":"IF(OR(O18=7,O18=2),7,0)","v":0},null,null,{"$f":"SUM(IF(G37:Q37=7,1,0))","v":0},null,9,"¨"]
[null,null,null,null,8,null,{"$f":"IF(OR(G18=8,G18=2),8,0)","v":0},null,{"$f":"IF(OR(I18=8,I18=2),8,0)","v":0},null,{"$f":"IF(OR(K18=8,K18=2),8,0)","v":0},null,{"$f":"IF(OR(M18=8,M18=2),8,0)","v":0},null,{"$f":"IF(OR(O18=8,O18=2),8,0)","v":0},null,null,{"$f":"SUM(IF(G38:Q38=8,1,0))","v":0},null,10,"¨"]
[null,null,null,null,9,null,{"$f":"IF(OR(G18=9,G18=2),9,0)","v":0},null,{"$f":"IF(OR(I18=9,I18=2),9,0)","v":0},null,{"$f":"IF(OR(K18=9,K18=2),9,0)","v":0},null,{"$f":"IF(OR(M18=9,M18=2),9,0)","v":9},null,{"$f":"IF(OR(O18=9,O18=2),9,0)","v":0},null,null,{"$f":"SUM(IF(G39:Q39=9,1,0))","v":1},null,"J","¨"]
[null,null,null,null,10,null,{"$f":"IF(OR(G18=10,G18=2),10,0)","v":0},null,{"$f":"IF(OR(I18=10,I18=2),10,0)","v":0},null,{"$f":"IF(OR(K18=10,K18=2),10,0)","v":0},null,{"$f":"IF(OR(M18=10,M18=2),10,0)","v":0},null,{"$f":"IF(OR(O18=10,O18=2),10,0)","v":0},null,null,{"$f":"SUM(IF(G40:Q40=10,1,0))","v":0},null,"Q","¨"]
[null,null,null,null,11,null,{"$f":"IF(OR(G18=\"J\",G18=2),11,0)","v":0},null,{"$f":"IF(OR(I18=\"J\",I18=2),11,0)","v":0},null,{"$f":"IF(OR(K18=\"J\",K18=2),11,0)","v":0},null,{"$f":"IF(OR(M18=\"J\",M18=2),11,0)","v":0},null,{"$f":"IF(OR(O18=\"J\",O18=2),11,0)","v":0},null,null,{"$f":"SUM(IF(G41:Q41=11,1,0))","v":0},null,"K","¨"]
[null,null,null,null,12,null,{"$f":"IF(OR(G18=\"Q\",G18=2),12,0)","v":0},null,{"$f":"IF(OR(I18=\"Q\",I18=2),12,0)","v":0},null,{"$f":"IF(OR(K18=\"Q\",K18=2),12,0)","v":12},null,{"$f":"IF(OR(M18=\"Q\",M18=2),12,0)","v":0},null,{"$f":"IF(OR(O18=\"Q\",O18=2),12,0)","v":0},null,null,{"$f":"SUM(IF(G42:Q42=12,1,0))","v":1},null,"A","©"]
[null,null,null,null,13,null,{"$f":"IF(OR(G18=\"K\",G18=2),13,0)","v":0},null,{"$f":"IF(OR(I18=\"K\",I18=2),13,0)","v":0},null,{"$f":"IF(OR(K18=\"K\",K18=2),13,0)","v":0},null,{"$f":"IF(OR(M18=\"K\",M18=2),13,0)","v":0},null,{"$f":"IF(OR(O18=\"K\",O18=2),13,0)","v":0},null,{"$f":"SUM(IF(G44:O44>15,1,0))","v":0},{"$f":"SUM(IF(G43:Q43=13,1,0))","v":0},null,2,"©"]
[null,null,null,null,null,null,{"$f":"SUM(G31:G43)","v":14},null,{"$f":"SUM(I31:I43)","v":4},null,{"$f":"SUM(K31:K43)","v":12},null,{"$f":"SUM(M31:M43)","v":9},null,{"$f":"SUM(O31:O43)","v":6},null,{"$f":"SUM(IF(G44:O44>9,1,0))","v":2},{"$f":"IF(AND(R31=1,R32=0),1,0)","v":1},null,3,"©"]
[null,null,null,null,null,null,{"$f":"IF(G44>13,\"\",G44)","v":""},null,{"$f":"IF(I44>13,\"\",I44)","v":4},null,{"$f":"IF(K44>13,\"\",K44)","v":12},null,{"$f":"IF(M44>13,\"\",M44)","v":9},null,{"$f":"IF(O44>13,\"\",O44)","v":6},null,null,null,null,4,"©"]
[null,null,null,null,null,null,{"$f":"IF(G45=1,14,G45)","v":""},null,{"$f":"IF(I45=1,14,I45)","v":4},null,{"$f":"IF(K45=1,14,K45)","v":12},null,{"$f":"IF(M45=1,14,M45)","v":9},null,{"$f":"IF(O45=1,14,O45)","v":6},null,"3 kind",{"$f":"SUM(IF(R31:R43>2,1,0))","v":0},null,5,"©"]
[null,null,null,null,null,null,null,null,null,null,null,null,null,null,null,null,"straight",{"$f":"IF(I58+K58>0,1,0)","v":0},null,6,"©"]
[null,null,null,null,null,null,{"$f":"STDEV(G45,I45,K45,M45,O45)","v":3.5},null,{"$f":"IF(AND(G48=1.58113883008419,R32=0),1,0)","v":0},null,{"$f":"IF(AND(G49=1.58113883008419,R32=0),1,0)","v":0},null,"nat",null,null,null,"flush",{"$f":"IF(AND(G19=I19,I19=K19,K19=M19,M19=O19),1,0)","v":0},null,7,"©"]
[null,null,null,null,null,null,{"$f":"STDEV(G46,I46,K46,M46,O46)","v":3.5},null,{"$f":"IF(AND(G48=1.29099444873581,R32=1),1,0)","v":0},null,{"$f":"IF(AND(G49=1.29099444873581,R32=1),1,0)","v":0},null,null,null,null,null,"f house",{"$f":"IF(AND(R61>1,R46>0,R61<3),1,0)","v":0},null,8,"©"]
[null,null,null,null,null,null,null,null,{"$f":"IF(AND(G48=1,R32=2),1,0)","v":0},null,{"$f":"IF(AND(G49=1,R32=2),1,0)","v":0},null,null,null,null,null,"4 kind",{"$f":"SUM(IF(R31:R43>3,1,0))","v":0},null,9,"©"]
[null,null,null,null,null,null,null,null,{"$f":"IF(AND(G48=0.707106781186548,R32=3),1,0)","v":0},null,{"$f":"IF(AND(G49=0.707106781186548,R32=3),1,0)","v":0},null,null,null,null,null,"st flsh",{"$f":"IF(AND(R48=1,R47=1),1,0)","v":0},null,10,"©"]
[null,null,null,null,null,null,null,null,{"$f":"IF(AND(G48=1.70782512765993,R32=1),1,0)","v":0},null,{"$f":"IF(AND(G49=1.70782512765993,R32=1),1,0)","v":0},null,null,null,null,null,"5 kind",{"$f":"SUM(IF(R31:R43>4,1,0))","v":0},null,"J","©"]
[null,null,null,null,null,null,null,null,{"$f":"IF(AND(G48=2.08166599946613,R32=2),1,0)","v":0},null,{"$f":"IF(AND(G49=2.08166599946613,R32=2),1,0)","v":0},null,null,null,null,null,"w r flsh",{"$f":"IF(AND(Q44=5,R48=1),1,0)","v":0},null,"Q","©"]
[null,null,null,null,null,null,null,null,{"$f":"IF(AND(G48=2,R32=2),1,0)","v":0},null,{"$f":"IF(AND(G49=2,R32=2),1,0)","v":0},null,null,null,null,null,"4 2S",{"$f":"IF(R32=4,1,0)","v":0},null,"K","©"]
[null,null,null,null,null,null,null,null,{"$f":"IF(AND(G48=1.52752523165195,R32=2),1,0)","v":0},null,{"$f":"IF(AND(G49=1.52752523165195,R32=2),1,0)","v":0},null,null,null,null,null,"r flsh",{"$f":"IF(AND(Q44=5,R48=1,Q43=0),1,0)","v":0}]
[null,null,null,null,null,null,null,null,{"$f":"IF(AND(G48=1.82574185835055,R32=1),1,0)","v":0},null,{"$f":"IF(AND(G49=1.82574185835055,R32=1),1,0)","v":0}]
[]
[null,null,null,null,null,null,null,null,{"$f":"IF(ISERROR(SUM(I48:I56)),0,SUM(I48:I56))","v":0},null,{"$f":"IF(ISERROR(SUM(K48:K56)),0,SUM(K48:K56))","v":0}]
[]
[null,null,null,null,null,null,null,null,null,null,null,null,null,null,null,null,"jack",{"$f":"R41","v":0}]
[null,null,null,null,null,null,null,null,null,null,null,null,null,null,null,null,"pair",{"$f":"SUM(IF(R31:R43>1,1,0))","v":0}]

{"sheet":"Set Up","index":4,"n_rows":7,"n_cols":6,"rows_kept":7,"cut":false,"hidden":false,"merged":[]}
[]
[]
[]
[]
[null,null,"Delay for Video Poker",29999999,null,"Increase to slow game speed. Reduce to speed game play"]
[]
[null,null,null,null,null,"Default is 29,999.999"]